ethics of dialogue
definition: The ethics of dialogue has drawn increasing attention from scholars in the humanities and social sciences, as well as from policy makers and problem solvers in the realms of business, government, and civil society. Ethical dialogue is an approach for human discourse and reasoning directed toward improved problem understanding and possible problem resolution. [Source: Encyclopedia of Business Ethics and Society; Ethics of Dialogue]
broader: theories of ethics
type: Concept

theories of ethics
type: Concept
narrower: ethics of dialogue

concepts
type: Collection
type: ConceptGroup
member: ethics of dialogue