concepts
type: Collection
type: ConceptGroup
member: ethnic segregation

ethnic segregation
definition: Ethnic segregation is the enforced or voluntary residential separation of two or more groups on the basis of cultural identity. Usually understood at the local scale among neighborhoods within a city, ethnic residential segregation also occurs at other geographic scales. [Source: Encyclopedia of Geography; Ethnic Segregation]
broader: social geography
type: Concept

social geography
type: Concept
narrower: ethnic segregation