euchre
definition: Euchre is a trick-taking card game typically played by four people in two partnerships. Originally played with 32 cards, Euchre now uses a deck of 24, with all cards between two and eight discarded. [Source: Encyclopedia of Play in Today's Society; Euchre]
broader: card games
type: Concept

concepts
type: Collection
type: ConceptGroup
member: euchre

card games
type: Concept
narrower: euchre