expert psychological testimony
definition: Expert testimony in psychology comes in many types and concerns a vast array of subjects. Psychological expertise ranges widely both in scientific subject areas and the breadth of the legal landscape covered. [Source: Encyclopedia of Psychology and Law; Expert Psychological Testimony]
broader: trial processes
type: Concept

trial processes
type: Concept
narrower: expert psychological testimony

concepts
type: Collection
type: ConceptGroup
member: expert psychological testimony