social network analysis
type: Concept
narrower: exponential random graph models

exponential random graph models
alternative label: ERGM/p*
definition: Exponential random graph models (ERGM/p*) are a class of statistical models principally used in the analysis of social networks but are more generally applicable to a variety of relational data sets. The models have analogues in spatial statistics and quantum mechanics. [Source: Encyclopedia of Social Networks; Exponential Random Graph Models (ERGM/p*)]
broader: social network analysis
type: Concept

concepts
type: Collection
type: ConceptGroup
member: exponential random graph models