export assistance program
definition: National governments have a vested interest in a high export quota. Not only do exports allow for the accumulation of foreign exchange reserves, exports also increase employment levels, improve productivity, and foster overall prosperity. [Source: Encyclopedia of Business in Today's World; Export Assistance Program]
broader: export/import strategies
type: Concept

export/import strategies
type: Concept
narrower: export assistance program

concepts
type: Collection
type: ConceptGroup
member: export assistance program