export/import strategies
type: Concept
narrower: export financing

export financing
definition: In today's business, competition in all export transactions takes place not only in the fields of product quality and pricing, but also in attractive payment terms offered by the exporter to the foreign buyer. Extending credit to foreign customers can be seen as a crucial means of enhancing export competitiveness. [Source: Encyclopedia of Business in Today's World; Export Financing]
broader: export/import strategies
type: Concept

concepts
type: Collection
type: ConceptGroup
member: export financing