behavioral therapy
type: Concept
narrower: fading

fading
definition: Fading is the process for reducing and removing stimulus or response prompts during instruction. Prompting and fading are companion procedures in instruction.
broader: behavioral therapy
type: Concept

concepts
type: Collection
type: ConceptGroup
member: fading