group influence
type: Concept
narrower: fads and fashions

concepts
type: Collection
type: ConceptGroup
member: fads and fashions

fads and fashions
definition: Fads are objects or activities that are popular with a group of people over a short period of time. Fads are also known as crazes. [Source: Encyclopedia of Group Processes & Intergroup Relations; Fads and Fashions]
broader: group influence
type: Concept