civil rights and civil liberties
type: Concept
narrower: fair housing

concepts
type: Collection
type: ConceptGroup
member: fair housing

fair housing
definition: Fair housing policy is a product of the American civil rights movement. Prior to the 1960s, American laws promoted segregation and discrimination in the housing market. [Source: Encyclopedia of Urban Studies; Fair Housing]
broader: civil rights and civil liberties
type: Concept