child obesity
type: Concept
narrower: family behavioral interventions

family behavioral interventions
definition: Obesity remains a complex disorder requiring a multifaceted treatment approach. Behavioral intervention is frequently referred to as behavioral weight control, behavioral treatment, and/or lifestyle modification. [Source: Encyclopedia of Obesity; Family Behavioral Interventions]
broader: child obesity
type: Concept

concepts
type: Collection
type: ConceptGroup
member: family behavioral interventions