interest groups and lobbies
type: Concept
narrower: farm lobby

concepts
type: Collection
type: ConceptGroup
member: farm lobby

farm lobby
definition: The farm lobby is a collection of interest groups representing agricultural producers in the United States. It held sway in U.S. agricultural policy for most of the twentieth century and continues to be influential today. [Source: The Encyclopedia of Political Science; Farm Lobby]
broader: interest groups and lobbies
type: Concept