electoral behavior of various groups
type: Concept
narrower: farm vote

concepts
type: Collection
type: ConceptGroup
member: farm vote

farm vote
definition: ON DECEMBER 12, 1956, as America was riding a wave of prosperity and economic growth, Senator John F. Kennedy (D-MA) addressed the American Farm Bureau National Convention in Miami Beach, Florida. [Source: Encyclopedia of U.S. Campaigns, Elections, and Electoral Behavior; Farm Vote]
broader: electoral behavior of various groups
type: Concept