concepts
type: Collection
type: ConceptGroup
member: fetal narcotic syndrome

substance abuse
type: Concept
narrower: fetal narcotic syndrome

fetal narcotic syndrome
definition: Fetal narcotic syndrome refers to the effects on the fetus and newborn of exposure to illicit substances—particularly cocaine, crack cocaine, and heroin—during pregnancy. Narcotic use during pregnancy poses risks to both the woman and the fetus, including miscarriage, poor fetal growth, placental problems, premature delivery, low birth weight, and stillbirth. [Source: Encyclopedia of Social Problems; Fetal Narcotic Syndrome]
broader: substance abuse
type: Concept