theories of ethics
type: Concept
narrower: fidelity (ethics)

concepts
type: Collection
type: ConceptGroup
member: fidelity (ethics)

fidelity (ethics)
definition: Fidelity is a word that means being faithful to obligations, duties, or observances. It means being true to one's word and having the disposition to fulfill promises. [Source: Encyclopedia of Business Ethics and Society; Fidelity]
broader: theories of ethics
type: Concept