first experience of sexual intercourse
definition: Losing one's virginity, or first intercourse, traditionally has meant engaging in vaginal-penile penetration. However, younger individuals are much more likely to view virginity loss as including a range of sexual activities. [Source: Encyclopedia of Human Relationships; Sexual Intercourse, First Experience Of]
broader: sexuality
type: Concept

sexuality
type: Concept
narrower: first experience of sexual intercourse

concepts
type: Collection
type: ConceptGroup
member: first experience of sexual intercourse