concepts
type: Collection
type: ConceptGroup
member: fisheries

fisheries
definition: Fisheries encompass the variety of human activities to harvest aquatic animals and plants. The term includes the harvest of fish per se as well as crustaceans, seaweeds, mollusks, and marine mammals, but not aquaculture. [Source: Encyclopedia of Environment and Society; Fisheries]
broader: animals
type: Concept

animals
type: Concept
narrower: fisheries