funnel plot
definition: In ∗meta-analysis, a graphic method of detecting ∗publication bias. The ∗sample sizes are plotted against the ∗effect sizes of the studies. [Source: Dictionary of Statistics & Methodology; Funnel Plot]
broader: meta-analysis
type: Concept

meta-analysis
type: Concept
narrower: funnel plot

methods
type: Collection
type: ConceptGroup
member: funnel plot