constitutional issues
type: Concept
narrower: gag rules

gag rules
definition: Court orders that bar the press from publishing articles containing certain types of information about pending court cases. Refusal to comply with the order may result in being held in contempt of court. [Source: Student's Guide to the Supreme Court; Gag Rules]
broader: constitutional issues
type: Concept

concepts
type: Collection
type: ConceptGroup
member: gag rules