game playing
definition: Game playing at work experientially links the structural features of work and employment with workers’ willingness to persist on the shop floor. Game playing at work constitutes an arena of autonomy and meaning that workers carve out in their daily activities on the shop floor. [Source: Sociology of Work: An Encyclopedia; Game Playing]
broader: everyday life at work
type: Concept

concepts
type: Collection
type: ConceptGroup
member: game playing

everyday life at work
type: Concept
narrower: game playing