environment and people
type: Concept
narrower: game ranching

concepts
type: Collection
type: ConceptGroup
member: game ranching

game ranching
definition: Game ranches are usually understood to mean an area of land, often enclosed by special fencing, where game animals are kept. There are many purposes for the existence of game ranches. [Source: Encyclopedia of Geography; Game Ranching]
broader: environment and people
type: Concept