gender equity
definition: Gender equity is the belief that girls and boys, women and men, should be treated equally; that they should have equal opportunities. Gender equity, as a concept, is an issue that affects both men and women, but because of the current nature of sport it is often seen as a women's issue. [Source: Encyclopedia of Sports Management and Marketing; Gender Equity]
broader: gender equality
type: Concept

gender equality
type: Concept
narrower: gender equity

concepts
type: Collection
type: ConceptGroup
member: gender equity