generation gap
definition: The concept of the generation gap is one that has become part of our cultural vernacular. Reputedly coined by renowned anthropologist Margaret Mead, the simplest definition of the concept is the differentiation (or gap) of values, attitudes, or behaviors between members of an older generation and a younger generation. [Source: Encyclopedia of Human Development; Generation Gap]
broader: aging and older development
type: Concept

aging and older development
type: Concept
narrower: generation gap

concepts
type: Collection
type: ConceptGroup
member: generation gap