genetic association
definition: Analytical epidemiologic studies investigate potential associations between exposures (e.g., risk factors) and outcomes (e.g., as identified in quantitative data on traits or diseases) of interest. Genetic association studies are a special type of analytical epidemiologic studies in which the exposure of interest is represented by a genetic factor. [Source: Encyclopedia of Epidemiology; Association, Genetic]
broader: genetics
type: Concept

genetics
type: Concept
narrower: genetic association

methods
type: Collection
type: ConceptGroup
member: genetic association