genetic studies of genius
definition: Between 1925 and 1959, Lewis M. Terman edited five volumes under the series title Genetic Studies of Genius (GSoG). Terman was also author or coauthor on every book except the second, a volume that constitutes the doctoral dissertation of his graduate student Catharine Cox. [Source: Encyclopedia of Giftedness, Creativity, and Talent; Genetic Studies of Genius]
broader: creativity studies
type: Concept

creativity studies
type: Concept
narrower: genetic studies of genius

concepts
type: Collection
type: ConceptGroup
member: genetic studies of genius