geographic information systems
type: Concept
narrower: geocollaboration

geocollaboration
definition: Geocollaboration is collaboration among place-based subjects that is facilitated with and through geographic information and technologies. Geocollaboration is a field of study that is multidisciplinary in nature, incorporating theory and methods from human-computer interaction (HCI), computer science, and psychology. [Source: Encyclopedia of Geography; Geocollaboration]
broader: geographic information systems
type: Concept

concepts
type: Collection
type: ConceptGroup
member: geocollaboration