geographies of fear
definition: Geographers who study fear are interested in its social and spatial rather than purely psychological qualities. Fear is an emotional reaction to a perceived threat that acquires meaning from its context. [Source: Encyclopedia of Geography; Fear, Geographies of]
broader: social geography
type: Concept

concepts
type: Collection
type: ConceptGroup
member: geographies of fear

social geography
type: Concept
narrower: geographies of fear