gifted Asian Americans
definition: Asian American students are a fast-growing minority population in schools in the United States. The term Asian is generally used for groups of people with physical and cultural characteristics resembling East Asian people. [Source: Encyclopedia of Giftedness, Creativity, and Talent; Asian American, Gifted]
broader: population
type: Concept

population
type: Concept
narrower: gifted Asian Americans

concepts
type: Collection
type: ConceptGroup
member: gifted Asian Americans