population
type: Concept
narrower: gifted men

concepts
type: Collection
type: ConceptGroup
member: gifted men

gifted men
definition: Although research studies of gifted boys are limited in number, studies of gifted men are even more scarce. Since the 1920s, when Lewis Terman sought to change the lens through which society viewed giftedness, few researchers have examined the life experiences of gifted males beyond their secondary school and collegiate years. [Source: Encyclopedia of Giftedness, Creativity, and Talent; Men, Gifted]
broader: population
type: Concept