developmental assessment
type: Concept
narrower: giftedness assessment

giftedness assessment
definition: Traditionally, giftedness has been defined as unusually high intellectual ability or potential. Recently, other definitions have been proposed to broaden the conception of giftedness beyond that which can be identified by high IQ scores. [Source: Encyclopedia of Applied Developmental Science; Assessment, Giftedness]
broader: developmental assessment
type: Concept

concepts
type: Collection
type: ConceptGroup
member: giftedness assessment