parenting
type: Concept
narrower: grandparenting

concepts
type: Collection
type: ConceptGroup
member: grandparenting

grandparenting
definition: Demographic change and changing family values have profoundly altered the nature of grandparenting. Grandparents and grandchildren spend more time with each other over extended periods of their life courses as a consequence of rising life expectancy. [Source: Encyclopedia of Family Health; Grandparenting]
broader: parenting
type: Concept