growth disorders
definition: Child growth is internationally recognized as an important public health indicator for monitoring nutritional status and health in populations. Growth is influenced by many factors such as heredity, genetic or congenital, illness and medications, nutrition, hormones, and psychosocial environment. [Source: Encyclopedia of Global Health; Growth Disorders]
broader: systemic diseases
type: Concept

systemic diseases
type: Concept
narrower: growth disorders

concepts
type: Collection
type: ConceptGroup
member: growth disorders