high school exit exams
definition: High school exit exams are part of a broader educational agenda that seeks to increase standards in public education. Requiring graduating students to take an exam to demonstrate mastery of content upon finishing high school reflects the academic achievement of the individual and provides an accountability measure for schools by indicating the proportion of their students that meet graduation standards. [Source: Sociology of Education: An A-to-Z Guide; High School Exit Exams]
broader: school systems, structures, and processes
type: Concept

concepts
type: Collection
type: ConceptGroup
member: high school exit exams

school systems, structures, and processes
type: Concept
narrower: high school exit exams