gifted and talented programs and interventions
type: Concept
narrower: honors programs

honors programs
definition: Honors programs exist as a means of enhancing the educational experience of academically gifted, talented, and motivated students. Although various forms of honors programs exist within K–12 education, this entry focuses on the honors programs at postsecondary institutions, specifically 4-year colleges and universities. [Source: Encyclopedia of Giftedness, Creativity, and Talent; Honors Programs]
broader: gifted and talented programs and interventions
type: Concept

concepts
type: Collection
type: ConceptGroup
member: honors programs