rural life
type: Concept
narrower: horticultural societies

horticultural societies
definition: Horticulturalists are cultivators who rely on hand labor rather than plow agriculture and grow trees, fruits, and vegetables rather than hard grains. In modern economic systems, horticulturalists tend to be market gardeners, vintners, orchard keepers, flower growers, or turf managers—all highly commercial specialties. [Source: Encyclopedia of Community: From the Village to the Virtual World; Horticultural Societies]
broader: rural life
type: Concept

concepts
type: Collection
type: ConceptGroup
member: horticultural societies