icelandic genetics database
definition: In 1998, the Althingi (Iceland's parliament) passed the Act on a Health Sector Database (No. 139) authorizing a centralized database of nonpersonally identifiable health data for all Icelanders. [Source: Encyclopedia of Epidemiology; Icelandic Genetics Database]
broader: genetics
type: Concept

genetics
type: Concept
narrower: icelandic genetics database

concepts
type: Collection
type: ConceptGroup
member: icelandic genetics database