stratification, power and inequality at work
type: Concept
narrower: ideal worker

ideal worker
definition: The concept of the ideal worker includes a clear, relentless commitment to paid work. Working long hours and not allowing distractions outside the paid work environment to interfere with the job, including family and personal facets of life, often exemplify an ideal worker's commitment to paid work performance. [Source: Sociology of Work: An Encyclopedia; Ideal Worker]
broader: stratification, power and inequality at work
type: Concept

concepts
type: Collection
type: ConceptGroup
member: ideal worker