concepts
type: Collection
type: ConceptGroup
member: idiocentrism

idiocentrism
definition: The word idio means own, personal, private, peculiar, and distinct. The word centrism refers to adopting the middle position between two extreme viewpoints. [Source: Encyclopedia of Counseling; Idiocentrism]
broader: race, ethnicity and migration
type: Concept

race, ethnicity and migration
type: Concept
narrower: idiocentrism