concepts
type: Collection
type: ConceptGroup
member: igloo

cross-national research
type: Concept
narrower: igloo

igloo
definition: The igloo is one of the house types of the Eskimo people. Eskimo culture developed along the shores of the Baffin Land and the northern parts of Hudson Bay in latitudes 65 to 70 and has been there for more than 2,000 years. [Source: The Encyclopedia of Housing; Igloo]
broader: cross-national research
type: Concept