image registration
definition: Image registration is the process of precisely overlaying two (or more) images of the same area through geometrically aligning common features (or control points) identified in the images. The images can be taken at different times, from different viewpoints, and/or by different sensors. [Source: Encyclopedia of Geography; Image Registration]
broader: remote sensing
type: Concept

remote sensing
type: Concept
narrower: image registration

concepts
type: Collection
type: ConceptGroup
member: image registration