image texture
definition: Image texture refers to the subtle spectral differences present in digital or analog images and is defined as the spatial variation in pixel intensities or brightness values. The two most common ways to compute image texture are through first-order or second-order gray-level statistics. [Source: Encyclopedia of Geography; Image Texture]
broader: remote sensing
type: Concept

remote sensing
type: Concept
narrower: image texture

concepts
type: Collection
type: ConceptGroup
member: image texture