imaging technology
definition: THE COMMON UNDERLYING principle about cancer therapy is that early detection usually results in better management and a more favorable outcome. There currently exists a wide variety of imaging technologies that can assist in the early detection of cancerous growth. [Source: Encyclopedia of Cancer and Society; Technology, Imaging]
broader: cancer and society
type: Concept

concepts
type: Collection
type: ConceptGroup
member: imaging technology

cancer and society
type: Concept
narrower: imaging technology