concepts
type: Collection
type: ConceptGroup
member: incidents versus crises

incidents versus crises
definition: The term incidents differs from the term crises. The word incidents is commonly used to denote actions requiring immediate emergency responder attention, usually tactical operations. [Source: Encyclopedia of Crisis Management; Incidents versus Crises]
broader: issues in crisis management
type: Concept

issues in crisis management
type: Concept
narrower: incidents versus crises