discrimination
type: Concept
narrower: inclusionary zoning

concepts
type: Collection
type: ConceptGroup
member: inclusionary zoning

inclusionary zoning
definition: Inclusionary zoning is a program in which developers provide affordable dwelling units in new housing developments. They may be allowed to participate voluntarily, or the program may be mandatory. [Source: The Encyclopedia of Housing; Inclusionary Zoning]
broader: discrimination
type: Concept