indirect export
definition: Exporting to foreign markets takes two forms. Direct exporting means setting up expensive subsidiaries or establishing contractual relationship with foreign companies. [Source: Encyclopedia of Business in Today's World; Indirect Export]
broader: export/import strategies
type: Concept

export/import strategies
type: Concept
narrower: indirect export

concepts
type: Collection
type: ConceptGroup
member: indirect export