infant perception: methods of testing
definition: Scientists once thought that infants perceived the world as a “blooming, buzzing confusion.” One reason scientists now know this idea is wrong is that testing methods have been devised to ask questions about what infants see, hear, smell, and taste. This entry describes some of the most important methods of testing in the study of infant perception.Infants and nonhuman animals pose similar challenges to a perceptual scientist: neither can follow instructions, respond to requests, or maintain interest in a task for extended periods. [Source: Encyclopedia of Perception; Infant Perception: Methods of Testing]
broader: perceptual development/experience
type: Concept

concepts
type: Collection
type: ConceptGroup
member: infant perception: methods of testing

perceptual development/experience
type: Concept
narrower: infant perception: methods of testing