suicide
type: Concept
narrower: inmate suicide

inmate suicide
definition: the taking of one's own life by an inmate of a jail, prison, or other detention or correctional facility. [Source: The Concise Dictionary of Crime and Justice; Inmate Suicide]
broader: suicide
type: Concept

concepts
type: Collection
type: ConceptGroup
member: inmate suicide