intellectual capital
definition: The combined intangible assets (tacit knowledge, experience, and social networks) of an organization. In a knowledge-based economy, the intellectual capital that exists within the organization is more valuable than the company's tangible assets and capital. [Source: Dictionary of Strategy: Strategic Management A-Z; Intellectual Capital]
broader: knowledge management
type: Concept

concepts
type: Collection
type: ConceptGroup
member: intellectual capital

knowledge management
type: Concept
narrower: intellectual capital