planning, strategy, and command and control
type: Concept
narrower: intelligence gathering in war

intelligence gathering in war
definition: Since the Revolutionary War era, American political and military leaders have recognized the value of gathering intelligence on their adversaries, especially in wartime. Early attempts to collect intelligence in wartime were typically small, ad hoc efforts that ended quickly once peace returned. [Source: Encyclopedia of War & American Society; Intelligence Gathering in War]
broader: planning, strategy, and command and control
type: Concept

concepts
type: Collection
type: ConceptGroup
member: intelligence gathering in war