intergovernmental and intersystem incentives
definition: Modern disaster management systems consist of a broad range of national and international government and nongovernmental (NGO) actors that participate at different stages of the disaster cycle, from mitigation to preparedness, response, and recovery efforts. However, not all are willing or capable partners. [Source: Encyclopedia of Disaster Relief; Incentives, Intergovernmental and Intersystem]
broader: disaster mitigation
type: Concept

concepts
type: Collection
type: ConceptGroup
member: intergovernmental and intersystem incentives

disaster mitigation
type: Concept
narrower: intergovernmental and intersystem incentives